Target
M-phase inducer phosphatase 2
Ligand
BDBM31757
Substrate
Meas. Tech.
Cdc25B Catalytic Domain Protein Tyrosine Phosphatase Probe Assessment Dose Response assay in 25 mM DTT and Catalase.
IC50
16013.00049±n/a nM
Citation
 PubChem, PC Cdc25B Catalytic Domain Protein Tyrosine Phosphatase Probe Assessment Dose Response assay in 25 mM DTT and Catalase. PubChem Bioassay (2007)[AID] 
Target
Name:
M-phase inducer phosphatase 2
Synonyms:
CDC25B Dual specificity phosphatase (CDC25B) M-phase inducer phosphatase 2 (CDC25B) | MPIP2_HUMAN
Type:
Protein
Mol. Mass.:
64985.27
Organism:
Homo sapiens (Human)
Description:
Residue:
580
  
Inhibitor
Name:
BDBM31757
Synonyms:
6-hydroxy-3a,4,5,9b-tetrahydro-3H-cyclopenta[c]quinoline-4-carboxylic acid MLS-0015717.0001 | cid_654089
Type:
Small organic molecule
Emp. Form.:
C13H13NO3
Mol. Mass.:
231.2472
SMILES:
OC(=O)C1Nc2c(O)cccc2C2C=CCC12
: