Target
M-phase inducer phosphatase 2
Ligand
BDBM38802
Substrate
Meas. Tech.
Cdc25B Catalytic Domain Protein Tyrosine Phosphatase Probe Assessment Dose Response assay in 25 mM DTT and Catalase.
IC50
>50000±n/a nM
Citation
 PubChem, PC Cdc25B Catalytic Domain Protein Tyrosine Phosphatase Probe Assessment Dose Response assay in 25 mM DTT and Catalase. PubChem Bioassay (2007)[AID] 
Target
Name:
M-phase inducer phosphatase 2
Synonyms:
CDC25B Dual specificity phosphatase (CDC25B) M-phase inducer phosphatase 2 (CDC25B) | MPIP2_HUMAN
Type:
Protein
Mol. Mass.:
64985.27
Organism:
Homo sapiens (Human)
Description:
Residue:
580
  
Inhibitor
Name:
BDBM38802
Synonyms:
MLS000038842 cid_659226
Type:
Small organic molecule
Emp. Form.:
C21H16BrNO6
Mol. Mass.:
458.259
SMILES:
CCOC(=O)C(C(=O)OCC)c1cc(Br)c2noc3-c4ccccc4C(=O)c1c23
: