Target
M-phase inducer phosphatase 2
Ligand
BDBM32085
Substrate
Meas. Tech.
Cdc25B Catalytic Domain Protein Tyrosine Phosphatase Probe Assessment Dose Response assay in 25 mM DTT and Catalase.
IC50
>50000±n/a nM
Citation
 PubChem, PC Cdc25B Catalytic Domain Protein Tyrosine Phosphatase Probe Assessment Dose Response assay in 25 mM DTT and Catalase. PubChem Bioassay (2007)[AID] 
Target
Name:
M-phase inducer phosphatase 2
Synonyms:
CDC25B Dual specificity phosphatase (CDC25B) M-phase inducer phosphatase 2 (CDC25B) | MPIP2_HUMAN
Type:
Protein
Mol. Mass.:
64985.27
Organism:
Homo sapiens (Human)
Description:
Residue:
580
  
Inhibitor
Name:
BDBM32085
Synonyms:
MLS000085603 N-(2-hydroxy-1,3-dioxo-2,3-dihydro-1H-inden-2-yl)benzamide N-(2-hydroxy-1,3-dioxoinden-2-yl)benzamide SMR000020538 | cid_3237318
Type:
Small organic molecule
Emp. Form.:
C16H11NO4
Mol. Mass.:
281.2628
SMILES:
OC1(NC(=O)c2ccccc2)C(=O)c2ccccc2C1=O
: