Target
Estrogen receptor
Ligand
BDBM33071
Substrate
Meas. Tech.
Estrogen Receptor-alpha Coactivator Binding Inhibitors Dose Response Confirmation
IC50
>50000±n/a nM
Citation
 PubChem, PC Estrogen Receptor-alpha Coactivator Binding Inhibitors Dose Response Confirmation PubChem Bioassay (2007)[AID] 
Target
Name:
Estrogen receptor
Synonyms:
ER ESR ESR1_HUMAN Estrogen receptor Estrogen receptor (ER-alpha) Estrogen receptor alpha (ER) Nuclear receptor subfamily 3 group A member 1
Type:
Protein
Mol. Mass.:
66230.44
Organism:
Homo sapiens (Human)
Description:
P03372
Residue:
595
  
Inhibitor
Name:
BDBM33071
Synonyms:
2,3-Di-furan-2-yl-quinoxaline-6-carboxylic acid (2-hydroxy-ethyl)-amide 2,3-bis(2-furyl)-N-(2-hydroxyethyl)quinoxaline-6-carboxamide MLS000529296 cid_3157644
Type:
Small organic molecule
Emp. Form.:
C19H15N3O4
Mol. Mass.:
349.3401
SMILES:
OCCNC(=O)c1ccc2nc(-c3ccco3)c(nc2c1)-c1ccco1
: