Target
Coagulation factor XII
Ligand
BDBM40333
Substrate
Meas. Tech.
Factor XIIa Dose Response Confirmation
IC50
>50000±0 nM
Citation
 PubChem, PC Factor XIIa Dose Response Confirmation PubChem Bioassay (2008)[AID] 
Target
Name:
Coagulation factor XII
Synonyms:
Beta-factor XIIa part 1 Carboxylesterase 2 (intestine, liver) Coagulation factor XII (FXII) Coagulation factor XIIa light chain FA12_HUMAN Factor XIIa (fXIIa) Hageman factor
Type:
Enzyme
Mol. Mass.:
67810.07
Organism:
Homo sapiens (Human)
Description:
P00748
Residue:
615
  
Inhibitor
Name:
BDBM40333
Synonyms:
1-Cyclopentyl-4-[1-(1-furan-2-ylmethyl-1H-tetrazol-5-yl)-3-methyl-butyl]-piperazine 1-cyclopentyl-4-[1-[1-(2-furfuryl)tetrazol-5-yl]-3-methyl-butyl]piperazine;hydrochloride 1-cyclopentyl-4-[1-[1-(furan-2-ylmethyl)tetrazol-5-yl]-3-methylbutyl]piperazine;hydrochloride SMR000005013 | cid_6603057
Type:
Small organic molecule
Emp. Form.:
C20H32N6O
Mol. Mass.:
372.5077
SMILES:
CC(C)CC(N1CCN(CC1)C1CCCC1)c1nnnn1Cc1ccco1
: