Target
Coagulation factor XII
Ligand
BDBM40352
Substrate
Meas. Tech.
Factor XIIa Dose Response Confirmation
IC50
>50000±0 nM
Citation
 PubChem, PC Factor XIIa Dose Response Confirmation PubChem Bioassay (2008)[AID] 
Target
Name:
Coagulation factor XII
Synonyms:
Beta-factor XIIa part 1 Carboxylesterase 2 (intestine, liver) Coagulation factor XII (FXII) Coagulation factor XIIa light chain FA12_HUMAN Factor XIIa (fXIIa) Hageman factor
Type:
Enzyme
Mol. Mass.:
67810.07
Organism:
Homo sapiens (Human)
Description:
P00748
Residue:
615
  
Inhibitor
Name:
BDBM40352
Synonyms:
(3,5-dimethyl-1,2-oxazol-4-yl)methyl 2-(4-chlorophenyl)acetate 2-(4-chlorophenyl)acetic acid (3,5-dimethyl-4-isoxazolyl)methyl ester MLS000048478 cid_2433558
Type:
Small organic molecule
Emp. Form.:
C14H14ClNO3
Mol. Mass.:
279.719
SMILES:
Cc1noc(C)c1COC(=O)Cc1ccc(Cl)cc1
: