Target
Dual specificity protein phosphatase 6
Ligand
BDBM31737
Substrate
Meas. Tech.
MKP-3 in vitro secondary assay for identification of irreversible and slow-binding inhibitors
IC50
13800±1300 nM
Citation
 PubChem, PC MKP-3 in vitro secondary assay for identification of irreversible and slow-binding inhibitors PubChem Bioassay (2008)[AID] 
Target
Name:
Dual specificity protein phosphatase 6
Synonyms:
DUS6_RAT MAP kinase phosphatase 3 Mitogen-activated protein kinase phosphatase 3 | Mkp3
Type:
Enzyme
Mol. Mass.:
42303.19
Organism:
Rattus norvegicus
Description:
gi_16758752
Residue:
381
  
Inhibitor
Name:
BDBM31737
Synonyms:
2-[5-[(Z)-(1-keto-5,7-dimethyl-thiazolo[3,2-a]benzimidazol-2-ylidene)methyl]-2-furyl]benzoic acid 2-[5-[(Z)-(5,7-dimethyl-1-oxo-2-thiazolo[3,2-a]benzimidazolylidene)methyl]-2-furanyl]benzoic acid MLS-0091943.0001 | cid_5341943
Type:
Small organic molecule
Emp. Form.:
C23H16N2O4S
Mol. Mass.:
416.449
SMILES:
Cc1cc(C)c2nc3s\c(=C/c4ccc(o4)-c4ccccc4C(O)=O)c(=O)n3c2c1
: