Target
Acetyl-CoA acetyltransferase/HMG-CoA reductase
Ligand
BDBM4078
Substrate
Meas. Tech.
High Throughput Screen to Identify Compounds that Inhibit Class II HMG-CoA Reductases - Confirmatory Screen
IC50
1265390±n/a nM
Citation
 PubChem, PC High Throughput Screen to Identify Compounds that Inhibit Class II HMG-CoA Reductases - Confirmatory Screen PubChem Bioassay (2008)[AID] 
Target
Name:
Acetyl-CoA acetyltransferase/HMG-CoA reductase
Synonyms:
Type:
Enzyme Catalytic Domain
Mol. Mass.:
86478.36
Organism:
Enterococcus faecalis
Description:
gi_9937384
Residue:
803
  
Inhibitor
Name:
BDBM4078
Synonyms:
6,7,13,14-tetrahydroxy-2,9-dioxatetracyclo[6.6.2.0^{4,16}.0^{11,15}]hexadeca-1(14),4(16),5,7,11(15),12-hexaene-3,10-dione ELLAGIC ACID Ellagic acid (18) MLS000069632 cid_5281855
Type:
Small organic molecule
Emp. Form.:
C14H6O8
Mol. Mass.:
302.1926
SMILES:
Oc1cc2c3c(oc(=O)c4cc(O)c(O)c(oc2=O)c34)c1O
: