Target
Lysosomal acid glucosylceramidase
Ligand
BDBM42273
Substrate
Meas. Tech.
Dose response cell-based high throughput screening assay to identify enhancers of beta-glucosidase activity
EC50
>50000±n/a nM
Citation
 PubChem, PC Dose response cell-based high throughput screening assay to identify enhancers of beta-glucosidase activity PubChem Bioassay (2008)[AID] 
Target
Name:
Lysosomal acid glucosylceramidase
Synonyms:
Acid beta-glucosidase Beta-glucocerebrosidase D-glucosyl-N-acylsphingosine glucohydrolase GBA1 GC GLUC Glucosylceramidase (GBA) Glucosylceramidase precursor (Beta-glucocerebrosidase) (Acid beta-glucosidase) (D-glucosyl-N-acylsphingosine glucohydrolase) (Alglucerase) (Imiglucerase) beta-glucocerebrosidase (GCase)
Type:
Enzyme
Mol. Mass.:
59724.64
Organism:
Homo sapiens (Human)
Description:
The beta-Glu activity was measured with commercially available beta-glucocerebrosidase (Ceredase) as the enzyme source.
Residue:
536
  
Inhibitor
Name:
BDBM42273
Synonyms:
4,5-Dichloro-isothiazole-3-carboxylic acid 1-[(thiophen-2-ylmethyl)-carbamoyl]-ethyl ester 4,5-dichloroisothiazole-3-carboxylic acid [2-keto-1-methyl-2-(2-thenylamino)ethyl] ester SMR000006588 [1-oxo-1-(thiophen-2-ylmethylamino)propan-2-yl] 4,5-dichloro-1,2-thiazole-3-carboxylate | cid_647824
Type:
Small organic molecule
Emp. Form.:
C12H10Cl2N2O3S2
Mol. Mass.:
365.255
SMILES:
CC(OC(=O)c1nsc(Cl)c1Cl)C(=O)NCc1cccs1
: