Target
Lysosomal acid glucosylceramidase
Ligand
BDBM42274
Substrate
Meas. Tech.
Dose response cell-based high throughput screening assay to identify enhancers of beta-glucosidase activity
EC50
>50000±n/a nM
Citation
 PubChem, PC Dose response cell-based high throughput screening assay to identify enhancers of beta-glucosidase activity PubChem Bioassay (2008)[AID] 
Target
Name:
Lysosomal acid glucosylceramidase
Synonyms:
Acid beta-glucosidase Beta-glucocerebrosidase D-glucosyl-N-acylsphingosine glucohydrolase GBA1 GC GLUC Glucosylceramidase (GBA) Glucosylceramidase precursor (Beta-glucocerebrosidase) (Acid beta-glucosidase) (D-glucosyl-N-acylsphingosine glucohydrolase) (Alglucerase) (Imiglucerase) beta-glucocerebrosidase (GCase)
Type:
Enzyme
Mol. Mass.:
59724.64
Organism:
Homo sapiens (Human)
Description:
The beta-Glu activity was measured with commercially available beta-glucocerebrosidase (Ceredase) as the enzyme source.
Residue:
536
  
Inhibitor
Name:
BDBM42274
Synonyms:
2-(4-Methoxy-benzenesulfonylamino)-N-{[(tetrahydro-furan-2-ylmethyl)-carbamoyl]-methyl}-N-o-tolyl-acetamide 2-[(4-methoxyphenyl)sulfonylamino]-N-(2-methylphenyl)-N-[2-oxo-2-(2-oxolanylmethylamino)ethyl]acetamide MLS000031838 SMR000004757 | cid_648647
Type:
Small organic molecule
Emp. Form.:
C23H29N3O6S
Mol. Mass.:
475.558
SMILES:
COc1ccc(cc1)S(=O)(=O)NCC(=O)N(CC(=O)NCC1CCCO1)c1ccccc1C
: