Target
Lysosomal acid glucosylceramidase
Ligand
BDBM42278
Substrate
Meas. Tech.
Dose response cell-based high throughput screening assay to identify enhancers of beta-glucosidase activity
EC50
>50000±n/a nM
Citation
 PubChem, PC Dose response cell-based high throughput screening assay to identify enhancers of beta-glucosidase activity PubChem Bioassay (2008)[AID] 
Target
Name:
Lysosomal acid glucosylceramidase
Synonyms:
Acid beta-glucosidase Beta-glucocerebrosidase D-glucosyl-N-acylsphingosine glucohydrolase GBA1 GC GLUC Glucosylceramidase (GBA) Glucosylceramidase precursor (Beta-glucocerebrosidase) (Acid beta-glucosidase) (D-glucosyl-N-acylsphingosine glucohydrolase) (Alglucerase) (Imiglucerase) beta-glucocerebrosidase (GCase)
Type:
Enzyme
Mol. Mass.:
59724.64
Organism:
Homo sapiens (Human)
Description:
The beta-Glu activity was measured with commercially available beta-glucocerebrosidase (Ceredase) as the enzyme source.
Residue:
536
  
Inhibitor
Name:
BDBM42278
Synonyms:
2-N-(3-acetamidophenyl)-1-N-(4-methylphenyl)pyrrolidine-1,2-dicarboxamide N'-(3-acetamidophenyl)-N-(p-tolyl)pyrrolidine-1,2-dicarboxamide Pyrrolidine-1,2-dicarboxylic acid 2-[(3-acetylamino-phenyl)-amide] 1-p-tolylamide cid_650709
Type:
Small organic molecule
Emp. Form.:
C21H24N4O3
Mol. Mass.:
380.4403
SMILES:
CC(=O)Nc1cccc(NC(=O)C2CCCN2C(=O)Nc2ccc(C)cc2)c1
: