Target
Lysosomal acid glucosylceramidase
Ligand
BDBM42281
Substrate
Meas. Tech.
Dose response cell-based high throughput screening assay to identify enhancers of beta-glucosidase activity
EC50
>50000±n/a nM
Citation
 PubChem, PC Dose response cell-based high throughput screening assay to identify enhancers of beta-glucosidase activity PubChem Bioassay (2008)[AID] 
Target
Name:
Lysosomal acid glucosylceramidase
Synonyms:
Acid beta-glucosidase Beta-glucocerebrosidase D-glucosyl-N-acylsphingosine glucohydrolase GBA1 GC GLUC Glucosylceramidase (GBA) Glucosylceramidase precursor (Beta-glucocerebrosidase) (Acid beta-glucosidase) (D-glucosyl-N-acylsphingosine glucohydrolase) (Alglucerase) (Imiglucerase) beta-glucocerebrosidase (GCase)
Type:
Enzyme
Mol. Mass.:
59724.64
Organism:
Homo sapiens (Human)
Description:
The beta-Glu activity was measured with commercially available beta-glucocerebrosidase (Ceredase) as the enzyme source.
Residue:
536
  
Inhibitor
Name:
BDBM42281
Synonyms:
MLS000031928 N-[2-[(4-methoxyphenyl)methylamino]-2-oxidanylidene-ethyl]-2-[(4-methylphenyl)sulfonylamino]-N-(oxolan-2-ylmethyl)ethanamide N-[2-[(4-methoxyphenyl)methylamino]-2-oxoethyl]-2-[(4-methylphenyl)sulfonylamino]-N-(oxolan-2-ylmethyl)acetamide SMR000004744 | cid_651872
Type:
Small organic molecule
Emp. Form.:
C24H31N3O6S
Mol. Mass.:
489.584
SMILES:
COc1ccc(CNC(=O)CN(CC2CCCO2)C(=O)CNS(=O)(=O)c2ccc(C)cc2)cc1
: