Target
Lysosomal acid glucosylceramidase
Ligand
BDBM42282
Substrate
Meas. Tech.
Dose response cell-based high throughput screening assay to identify enhancers of beta-glucosidase activity
EC50
>50000±n/a nM
Citation
 PubChem, PC Dose response cell-based high throughput screening assay to identify enhancers of beta-glucosidase activity PubChem Bioassay (2008)[AID] 
Target
Name:
Lysosomal acid glucosylceramidase
Synonyms:
Acid beta-glucosidase Beta-glucocerebrosidase D-glucosyl-N-acylsphingosine glucohydrolase GBA1 GC GLUC Glucosylceramidase (GBA) Glucosylceramidase precursor (Beta-glucocerebrosidase) (Acid beta-glucosidase) (D-glucosyl-N-acylsphingosine glucohydrolase) (Alglucerase) (Imiglucerase) beta-glucocerebrosidase (GCase)
Type:
Enzyme
Mol. Mass.:
59724.64
Organism:
Homo sapiens (Human)
Description:
The beta-Glu activity was measured with commercially available beta-glucocerebrosidase (Ceredase) as the enzyme source.
Residue:
536
  
Inhibitor
Name:
BDBM42282
Synonyms:
1-[(1-tert-Butyl-1H-tetrazol-5-yl)-(3,4-dimethoxy-phenyl)-methyl]-4-ethyl-piperazine 1-[(1-tert-butyl-5-tetrazolyl)-(3,4-dimethoxyphenyl)methyl]-4-ethylpiperazine;hydrochloride 1-[(1-tert-butyltetrazol-5-yl)-(3,4-dimethoxyphenyl)methyl]-4-ethylpiperazine;hydrochloride SMR000004877 | cid_6602654
Type:
Small organic molecule
Emp. Form.:
C20H32N6O2
Mol. Mass.:
388.5071
SMILES:
CCN1CCN(CC1)C(c1nnnn1C(C)(C)C)c1ccc(OC)c(OC)c1
: