Target
Lysosomal acid glucosylceramidase
Ligand
BDBM42288
Substrate
Meas. Tech.
Dose response cell-based high throughput screening assay to identify enhancers of beta-glucosidase activity
EC50
>50000±n/a nM
Citation
 PubChem, PC Dose response cell-based high throughput screening assay to identify enhancers of beta-glucosidase activity PubChem Bioassay (2008)[AID] 
Target
Name:
Lysosomal acid glucosylceramidase
Synonyms:
Acid beta-glucosidase Beta-glucocerebrosidase D-glucosyl-N-acylsphingosine glucohydrolase GBA1 GC GLUC Glucosylceramidase (GBA) Glucosylceramidase precursor (Beta-glucocerebrosidase) (Acid beta-glucosidase) (D-glucosyl-N-acylsphingosine glucohydrolase) (Alglucerase) (Imiglucerase) beta-glucocerebrosidase (GCase)
Type:
Enzyme
Mol. Mass.:
59724.64
Organism:
Homo sapiens (Human)
Description:
The beta-Glu activity was measured with commercially available beta-glucocerebrosidase (Ceredase) as the enzyme source.
Residue:
536
  
Inhibitor
Name:
BDBM42288
Synonyms:
2-(5-methyl-1,2-oxazol-3-yl)-5-(pyridin-3-ylmethylsulfanyl)-1,3,4-oxadiazole 2-(5-methylisoxazol-3-yl)-5-(3-pyridylmethylthio)-1,3,4-oxadiazole MLS000075236 cid_654305
Type:
Small organic molecule
Emp. Form.:
C12H10N4O2S
Mol. Mass.:
274.298
SMILES:
Cc1cc(no1)-c1nnc(SCc2cccnc2)o1
: