Target
Lysosomal acid glucosylceramidase
Ligand
BDBM42291
Substrate
Meas. Tech.
Dose response cell-based high throughput screening assay to identify enhancers of beta-glucosidase activity
EC50
>10000±n/a nM
Citation
 PubChem, PC Dose response cell-based high throughput screening assay to identify enhancers of beta-glucosidase activity PubChem Bioassay (2008)[AID] 
Target
Name:
Lysosomal acid glucosylceramidase
Synonyms:
Acid beta-glucosidase Beta-glucocerebrosidase D-glucosyl-N-acylsphingosine glucohydrolase GBA1 GC GLUC Glucosylceramidase (GBA) Glucosylceramidase precursor (Beta-glucocerebrosidase) (Acid beta-glucosidase) (D-glucosyl-N-acylsphingosine glucohydrolase) (Alglucerase) (Imiglucerase) beta-glucocerebrosidase (GCase)
Type:
Enzyme
Mol. Mass.:
59724.64
Organism:
Homo sapiens (Human)
Description:
The beta-Glu activity was measured with commercially available beta-glucocerebrosidase (Ceredase) as the enzyme source.
Residue:
536
  
Inhibitor
Name:
BDBM42291
Synonyms:
1-(5-chloranylpyridin-2-yl)-3-(phenylmethyl)pyrrolidine-2,5-dione 3-Benzyl-1-(5-chloro-pyridin-2-yl)-pyrrolidine-2,5-dione 3-benzyl-1-(5-chloropyridin-2-yl)pyrrolidine-2,5-dione SMR000013026 | cid_654927
Type:
Small organic molecule
Emp. Form.:
C16H13ClN2O2
Mol. Mass.:
300.74
SMILES:
Oc1cc(Cc2ccccc2)c(O)n1-c1ccc(Cl)cn1
: