Target
Lysosomal acid glucosylceramidase
Ligand
BDBM42297
Substrate
Meas. Tech.
Dose response cell-based high throughput screening assay to identify enhancers of beta-glucosidase activity
EC50
>50000±n/a nM
Citation
 PubChem, PC Dose response cell-based high throughput screening assay to identify enhancers of beta-glucosidase activity PubChem Bioassay (2008)[AID] 
Target
Name:
Lysosomal acid glucosylceramidase
Synonyms:
Acid beta-glucosidase Beta-glucocerebrosidase D-glucosyl-N-acylsphingosine glucohydrolase GBA1 GC GLUC Glucosylceramidase (GBA) Glucosylceramidase precursor (Beta-glucocerebrosidase) (Acid beta-glucosidase) (D-glucosyl-N-acylsphingosine glucohydrolase) (Alglucerase) (Imiglucerase) beta-glucocerebrosidase (GCase)
Type:
Enzyme
Mol. Mass.:
59724.64
Organism:
Homo sapiens (Human)
Description:
The beta-Glu activity was measured with commercially available beta-glucocerebrosidase (Ceredase) as the enzyme source.
Residue:
536
  
Inhibitor
Name:
BDBM42297
Synonyms:
3-(2-chlorobenzyl)-4-keto-7,8,9,10-tetrahydro-6H-pyrimido[3,4]pyrrol[3,5-a]azepine-11-carbonitrile 3-[(2-chlorophenyl)methyl]-4-oxo-7,8,9,10-tetrahydro-6H-pyrimido[3,4]pyrrolo[3,5-a]azepine-11-carbonitrile SMR000038693 | cid_657822
Type:
Small organic molecule
Emp. Form.:
C19H17ClN4O
Mol. Mass.:
352.817
SMILES:
Clc1ccccc1Cn1cnc2c(C#N)c3CCCCCn3c2c1=O
: