Target
Lysosomal acid glucosylceramidase
Ligand
BDBM42300
Substrate
Meas. Tech.
Dose response cell-based high throughput screening assay to identify enhancers of beta-glucosidase activity
EC50
>50000±n/a nM
Citation
 PubChem, PC Dose response cell-based high throughput screening assay to identify enhancers of beta-glucosidase activity PubChem Bioassay (2008)[AID] 
Target
Name:
Lysosomal acid glucosylceramidase
Synonyms:
Acid beta-glucosidase Beta-glucocerebrosidase D-glucosyl-N-acylsphingosine glucohydrolase GBA1 GC GLUC Glucosylceramidase (GBA) Glucosylceramidase precursor (Beta-glucocerebrosidase) (Acid beta-glucosidase) (D-glucosyl-N-acylsphingosine glucohydrolase) (Alglucerase) (Imiglucerase) beta-glucocerebrosidase (GCase)
Type:
Enzyme
Mol. Mass.:
59724.64
Organism:
Homo sapiens (Human)
Description:
The beta-Glu activity was measured with commercially available beta-glucocerebrosidase (Ceredase) as the enzyme source.
Residue:
536
  
Inhibitor
Name:
BDBM42300
Synonyms:
MLS000042121 N-(1,1-dioxo-3-thiolanyl)-2-(2-methylphenoxy)-N-(thiophen-2-ylmethyl)acetamide N-[1,1-bis(oxidanylidene)thiolan-3-yl]-2-(2-methylphenoxy)-N-(thiophen-2-ylmethyl)ethanamide cid_662623
Type:
Small organic molecule
Emp. Form.:
C18H21NO4S2
Mol. Mass.:
379.494
SMILES:
Cc1ccccc1OCC(=O)N(Cc1cccs1)C1CCS(=O)(=O)C1
: