Target
Lysosomal acid glucosylceramidase
Ligand
BDBM42304
Substrate
Meas. Tech.
Dose response cell-based high throughput screening assay to identify enhancers of beta-glucosidase activity
EC50
>50000±n/a nM
Citation
 PubChem, PC Dose response cell-based high throughput screening assay to identify enhancers of beta-glucosidase activity PubChem Bioassay (2008)[AID] 
Target
Name:
Lysosomal acid glucosylceramidase
Synonyms:
Acid beta-glucosidase Beta-glucocerebrosidase D-glucosyl-N-acylsphingosine glucohydrolase GBA1 GC GLUC Glucosylceramidase (GBA) Glucosylceramidase precursor (Beta-glucocerebrosidase) (Acid beta-glucosidase) (D-glucosyl-N-acylsphingosine glucohydrolase) (Alglucerase) (Imiglucerase) beta-glucocerebrosidase (GCase)
Type:
Enzyme
Mol. Mass.:
59724.64
Organism:
Homo sapiens (Human)
Description:
The beta-Glu activity was measured with commercially available beta-glucocerebrosidase (Ceredase) as the enzyme source.
Residue:
536
  
Inhibitor
Name:
BDBM42304
Synonyms:
2-(4-methoxyphenyl)sulfonyl-2-(3-piperidin-1-ylquinoxalin-2-yl)acetonitrile 2-(4-methoxyphenyl)sulfonyl-2-(3-piperidinoquinoxalin-2-yl)acetonitrile MLS000040987 cid_664159
Type:
Small organic molecule
Emp. Form.:
C22H22N4O3S
Mol. Mass.:
422.5
SMILES:
COc1ccc(cc1)S(=O)(=O)C(C#N)c1nc2ccccc2nc1N1CCCCC1
: