Target
Lysosomal acid glucosylceramidase
Ligand
BDBM42306
Substrate
Meas. Tech.
Dose response cell-based high throughput screening assay to identify enhancers of beta-glucosidase activity
EC50
>50000±n/a nM
Citation
 PubChem, PC Dose response cell-based high throughput screening assay to identify enhancers of beta-glucosidase activity PubChem Bioassay (2008)[AID] 
Target
Name:
Lysosomal acid glucosylceramidase
Synonyms:
Acid beta-glucosidase Beta-glucocerebrosidase D-glucosyl-N-acylsphingosine glucohydrolase GBA1 GC GLUC Glucosylceramidase (GBA) Glucosylceramidase precursor (Beta-glucocerebrosidase) (Acid beta-glucosidase) (D-glucosyl-N-acylsphingosine glucohydrolase) (Alglucerase) (Imiglucerase) beta-glucocerebrosidase (GCase)
Type:
Enzyme
Mol. Mass.:
59724.64
Organism:
Homo sapiens (Human)
Description:
The beta-Glu activity was measured with commercially available beta-glucocerebrosidase (Ceredase) as the enzyme source.
Residue:
536
  
Inhibitor
Name:
BDBM42306
Synonyms:
4-(4,6-dimethylpyrimidin-2-yl)sulfanyl-2-methyl-[1]benzofuro[3,2-d]pyrimidine 4-[(4,6-dimethylpyrimidin-2-yl)thio]-2-methyl-benzofuro[3,2-d]pyrimidine SMR000046175 | cid_665080
Type:
Small organic molecule
Emp. Form.:
C17H14N4OS
Mol. Mass.:
322.384
SMILES:
Cc1cc(C)nc(Sc2nc(C)nc3c4ccccc4oc23)n1
: