Target
Lysosomal acid glucosylceramidase
Ligand
BDBM42307
Substrate
Meas. Tech.
Dose response cell-based high throughput screening assay to identify enhancers of beta-glucosidase activity
EC50
>50000±n/a nM
Citation
 PubChem, PC Dose response cell-based high throughput screening assay to identify enhancers of beta-glucosidase activity PubChem Bioassay (2008)[AID] 
Target
Name:
Lysosomal acid glucosylceramidase
Synonyms:
Acid beta-glucosidase Beta-glucocerebrosidase D-glucosyl-N-acylsphingosine glucohydrolase GBA1 GC GLUC Glucosylceramidase (GBA) Glucosylceramidase precursor (Beta-glucocerebrosidase) (Acid beta-glucosidase) (D-glucosyl-N-acylsphingosine glucohydrolase) (Alglucerase) (Imiglucerase) beta-glucocerebrosidase (GCase)
Type:
Enzyme
Mol. Mass.:
59724.64
Organism:
Homo sapiens (Human)
Description:
The beta-Glu activity was measured with commercially available beta-glucocerebrosidase (Ceredase) as the enzyme source.
Residue:
536
  
Inhibitor
Name:
BDBM42307
Synonyms:
2-[[4-benzyl-5-(furan-2-yl)-1,2,4-triazol-3-yl]sulfanylmethyl]-1,3-benzothiazole 2-[[[4-benzyl-5-(2-furyl)-1,2,4-triazol-3-yl]thio]methyl]-1,3-benzothiazole MLS000096502 cid_2386422
Type:
Small organic molecule
Emp. Form.:
C21H16N4OS2
Mol. Mass.:
404.508
SMILES:
C(Sc1nnc(-c2ccco2)n1Cc1ccccc1)c1nc2ccccc2s1
: