Target
Neuropeptide Y receptor type 1
Ligand
BDBM42440
Substrate
Meas. Tech.
Dose response cell-based screening assay for antagonists of neuropeptide Y receptor Y1 (NPY-Y1)
IC50
<35000±n/a nM
Citation
 PubChem, PC Dose response cell-based screening assay for antagonists of neuropeptide Y receptor Y1 (NPY-Y1) PubChem Bioassay (2008)[AID] 
Target
Name:
Neuropeptide Y receptor type 1
Synonyms:
NPY-Y1 NPY1R NPYR neuropeptide Y receptor Y1
Type:
Enzyme Catalytic Domain
Mol. Mass.:
44399.07
Organism:
Homo sapiens (Human)
Description:
NPY-Y1 NPY1R HUMAN::P25929
Residue:
384
  
Inhibitor
Name:
BDBM42440
Synonyms:
1-{[3-(1,3-benzodioxol-5-yl)-1,2,4-oxadiazol-5-yl]methyl}-2-(1-methyl-1H-imidazol-2-yl)piperidine 3-(1,3-benzodioxol-5-yl)-5-[[2-(1-methylimidazol-2-yl)piperidin-1-yl]methyl]-1,2,4-oxadiazole MLS000734887 cid_16189203
Type:
Small organic molecule
Emp. Form.:
C19H21N5O3
Mol. Mass.:
367.4017
SMILES:
Cn1ccnc1C1CCCCN1Cc1nc(no1)-c1ccc2OCOc2c1
: