Target
Neuropeptide Y receptor type 1
Ligand
BDBM42575
Substrate
Meas. Tech.
Dose response counterscreen for neuropeptide Y receptor Y2 (NPY-Y2): Cell-based high throughput assay to measure NPY-Y1 antagonism
IC50
>35000±n/a nM
Citation
 PubChem, PC Dose response counterscreen for neuropeptide Y receptor Y2 (NPY-Y2): Cell-based high throughput assay to measure NPY-Y1 antagonism PubChem Bioassay (2008)[AID] 
Target
Name:
Neuropeptide Y receptor type 1
Synonyms:
NPY-Y1 NPY1R NPYR neuropeptide Y receptor Y1
Type:
Enzyme Catalytic Domain
Mol. Mass.:
44399.07
Organism:
Homo sapiens (Human)
Description:
NPY-Y1 NPY1R HUMAN::P25929
Residue:
384
  
Inhibitor
Name:
BDBM42575
Synonyms:
1-(diphenylmethyl)-4-[4-(2-methoxyphenoxy)butyl]piperazine oxalate 1-(diphenylmethyl)-4-[4-(2-methoxyphenoxy)butyl]piperazine;oxalic acid MLS000666807 cid_2924099
Type:
Small organic molecule
Emp. Form.:
C28H34N2O2
Mol. Mass.:
430.5818
SMILES:
COc1ccccc1OCCCCN1CCN(CC1)C(c1ccccc1)c1ccccc1
: