Target
Nuclear receptor coactivator 1
Ligand
BDBM42440
Substrate
Meas. Tech.
Dose response biochemical High Throughput Screening assay for agonists of the steroid receptor coactivator 1 (SRC-1) recruitment by the peroxisome proliferator-activated receptor gamma (PPARgamma)
EC50
>79370±n/a nM
Citation
 PubChem, PC Dose response biochemical High Throughput Screening assay for agonists of the steroid receptor coactivator 1 (SRC-1) recruitment by the peroxisome proliferator-activated receptor gamma (PPARgamma) PubChem Bioassay (2008)[AID] 
Target
Name:
Nuclear receptor coactivator 1
Synonyms:
BHLHE74 NCOA1 NCoA-1 Protein Hin-2 Renal carcinoma antigen NY-REN-52 SRC1 nuclear receptor coactivator 1 isoform 1
Type:
PROTEIN
Mol. Mass.:
156749.34
Organism:
Homo sapiens (Human)
Description:
ChEMBL_759690
Residue:
1441
  
Inhibitor
Name:
BDBM42440
Synonyms:
1-{[3-(1,3-benzodioxol-5-yl)-1,2,4-oxadiazol-5-yl]methyl}-2-(1-methyl-1H-imidazol-2-yl)piperidine 3-(1,3-benzodioxol-5-yl)-5-[[2-(1-methylimidazol-2-yl)piperidin-1-yl]methyl]-1,2,4-oxadiazole MLS000734887 cid_16189203
Type:
Small organic molecule
Emp. Form.:
C19H21N5O3
Mol. Mass.:
367.4017
SMILES:
Cn1ccnc1C1CCCCN1Cc1nc(no1)-c1ccc2OCOc2c1
: