Target
Apoptosis regulator Bcl-2
Ligand
BDBM32328
Substrate
Meas. Tech.
Multiplexed high-throughput screen for small molecule regulators of Bcl-2 family protein interactions, specifically Bim-Bcl-2
EC50
540±n/a nM
Citation
 PubChem, PC Multiplexed high-throughput screen for small molecule regulators of Bcl-2 family protein interactions, specifically Bim-Bcl-2 PubChem Bioassay (2008)[AID] 
Target
Name:
Apoptosis regulator Bcl-2
Synonyms:
Apoptosis regulator Bcl-2 Protein BCL-2 BCL2_HUMAN | Bcl-2 Protein
Type:
Homodimer or heterodimer
Mol. Mass.:
26269.11
Organism:
Homo sapiens (Human)
Description:
P10415
Residue:
239
  
Inhibitor
Name:
BDBM32328
Synonyms:
4-[2-[(6,7-dimethoxy-2-sulfanylidene-1H-quinazolin-4-yl)amino]ethyl]benzenesulfonamide 4-{2-[(6,7-dimethoxy-2-thioxo-1,2-dihydroquinazolin-4-yl)amino]ethyl}benzenesulfonamide SMR000314043 | cid_16195481
Type:
Small organic molecule
Emp. Form.:
C18H20N4O4S2
Mol. Mass.:
420.506
SMILES:
COc1cc2nc(=S)[nH]c(NCCc3ccc(cc3)S(N)(=O)=O)c2cc1OC
: