Target
Induced myeloid leukemia cell differentiation protein Mcl-1
Ligand
BDBM32318
Substrate
Meas. Tech.
Multiplexed dose response screen for small molecule regulators of Bcl-2 family protein interactions, specifically Bim-Mcl-1.
EC50
390±n/a nM
Citation
 PubChem, PC Multiplexed dose response screen for small molecule regulators of Bcl-2 family protein interactions, specifically Bim-Mcl-1. PubChem Bioassay (2008)[AID] 
Target
Name:
Induced myeloid leukemia cell differentiation protein Mcl-1
Synonyms:
BCL2L3 Bcl-2-like protein 3 (Mcl-1) Bcl2-L-3 MCL1 Mcl-1 Myeloid cell leukemia sequence 1 (BCL2-related) | mcl1/EAT
Type:
Membrane; Single-pass membrane protein
Mol. Mass.:
37332.87
Organism:
Homo sapiens (Human)
Description:
Q07820
Residue:
350
  
Inhibitor
Name:
BDBM32318
Synonyms:
4-[[4-(2-methyl-3-imidazo[1,2-a]pyrimidinyl)-2-thiazolyl]amino]phenol;hydrobromide 4-[[4-(2-methylimidazo[1,2-a]pyrimidin-3-yl)thiazol-2-yl]amino]phenol;hydrobromide SMR000277160 | cid_5337459
Type:
Small organic molecule
Emp. Form.:
C16H13N5OS
Mol. Mass.:
323.372
SMILES:
Cc1nc2ncccn2c1-c1csc(Nc2ccc(O)cc2)n1
: