Target
DNA-directed RNA polymerase subunit beta
Ligand
BDBM43312
Substrate
Meas. Tech.
RNA polymerase SAR
IC50
>50000±n/a nM
Citation
 PubChem, PC RNA polymerase SAR PubChem Bioassay (2008)[AID] 
Target
Name:
DNA-directed RNA polymerase subunit beta
Synonyms:
RNA polymerase beta subunit (EC 2.7.7.6)
Type:
Enzyme Catalytic Domain
Mol. Mass.:
150595.80
Organism:
Escherichia coli
Description:
A0A0E2LB94
Residue:
1342
  
Inhibitor
Name:
BDBM43312
Synonyms:
4-(4-methoxyphenyl)-N-(4-oxidanylnaphthalen-1-yl)benzenesulfonamide N-(4-hydroxy-1-naphthyl)-4-(4-methoxyphenyl)benzenesulfonamide PC-0599226 cid_16738590
Type:
Small organic molecule
Emp. Form.:
C23H19NO4S
Mol. Mass.:
405.466
SMILES:
COc1ccc(cc1)-c1ccc(cc1)S(=O)(=O)Nc1ccc(O)c2ccccc12
: