Target
DNA-directed RNA polymerase subunit beta
Ligand
BDBM43313
Substrate
Meas. Tech.
RNA polymerase SAR
IC50
>50000±n/a nM
Citation
 PubChem, PC RNA polymerase SAR PubChem Bioassay (2008)[AID] 
Target
Name:
DNA-directed RNA polymerase subunit beta
Synonyms:
RNA polymerase beta subunit (EC 2.7.7.6)
Type:
Enzyme Catalytic Domain
Mol. Mass.:
150595.80
Organism:
Escherichia coli
Description:
A0A0E2LB94
Residue:
1342
  
Inhibitor
Name:
BDBM43313
Synonyms:
4-methoxy-N-(4-oxidanylnaphthalen-1-yl)benzamide N-(4-hydroxy-1-naphthyl)-4-methoxy-benzamide PC-0626758 cid_11022725
Type:
Small organic molecule
Emp. Form.:
C18H15NO3
Mol. Mass.:
293.3166
SMILES:
COc1ccc(cc1)C(=O)Nc1ccc(O)c2ccccc12
: