Target
DNA-directed RNA polymerase subunit beta
Ligand
BDBM43324
Substrate
Meas. Tech.
RNA polymerase SAR
IC50
>50000±n/a nM
Citation
 PubChem, PC RNA polymerase SAR PubChem Bioassay (2008)[AID] 
Target
Name:
DNA-directed RNA polymerase subunit beta
Synonyms:
RNA polymerase beta subunit (EC 2.7.7.6)
Type:
Enzyme Catalytic Domain
Mol. Mass.:
150595.80
Organism:
Escherichia coli
Description:
A0A0E2LB94
Residue:
1342
  
Inhibitor
Name:
BDBM43324
Synonyms:
1-(2-hydroxy-1-naphthalenyl)-3-(4-methoxyphenyl)urea 1-(2-hydroxynaphthalen-1-yl)-3-(4-methoxyphenyl)urea PC-0626769 cid_16738599
Type:
Small organic molecule
Emp. Form.:
C18H16N2O3
Mol. Mass.:
308.3312
SMILES:
COc1ccc(NC(=O)Nc2c(O)ccc3ccccc23)cc1
: