Target
Signal transducer and activator of transcription 1-alpha/beta
Ligand
BDBM43524
Substrate
Meas. Tech.
Dose response cell-based assay to measure STAT1 inhibition
IC50
12050±n/a nM
Citation
 PubChem, PC Dose response cell-based assay to measure STAT1 inhibition PubChem Bioassay (2008)[AID] 
Target
Name:
Signal transducer and activator of transcription 1-alpha/beta
Synonyms:
STAT1 Signal transducer and activator of transcription 1-alpha/beta Transcription factor ISGF-3 components p91/p84 | signal transducer and activator of transcription 1 isoform alpha
Type:
Cytosolic Transcription Factor
Mol. Mass.:
87327.69
Organism:
Homo sapiens (Human)
Description:
Stat1 was expressed in sf9 cells from a baculovirus encoding the recombinant proteins. Stat1 dimer binds to DNA.
Residue:
750
  
Inhibitor
Name:
BDBM43524
Synonyms:
4-(4-fluorophenyl)-2-(methylsulfonyl)-6-(trifluoromethyl)pyrimidine 4-(4-fluorophenyl)-2-methylsulfonyl-6-(trifluoromethyl)pyrimidine SMR000297077 cid_2987363
Type:
Small organic molecule
Emp. Form.:
C12H8F4N2O2S
Mol. Mass.:
320.263
SMILES:
CS(=O)(=O)c1nc(cc(n1)C(F)(F)F)-c1ccc(F)cc1
: