Target
Alkaline phosphatase, tissue-nonspecific isozyme
Ligand
BDBM50299524
Substrate
Meas. Tech.
SAR analysis of an In Vitro TNAP Dose Response Luminescent Assay
IC50
1060±n/a nM
Citation
 PubChem, PC SAR analysis of an In Vitro TNAP Dose Response Luminescent Assay PubChem Bioassay (2010)[AID] 
Target
Name:
Alkaline phosphatase, tissue-nonspecific isozyme
Synonyms:
ALPL tissue-nonspecific alkaline phosphatase precursor
Type:
PROTEIN
Mol. Mass.:
57306.17
Organism:
Homo sapiens (Human)
Description:
ChEMBL_1448917
Residue:
524
  
Inhibitor
Name:
BDBM50299524
Synonyms:
2,5-Dimethoxy-N-(pyridin-3-yl)benzenesulfonamide cid_893397
Type:
Small organic molecule
Emp. Form.:
C13H14N2O4S
Mol. Mass.:
294.326
SMILES:
COc1ccc(OC)c(c1)S(=O)(=O)Nc1cccnc1
: