Target
Alkaline phosphatase, tissue-nonspecific isozyme
Ligand
BDBM50299540
Substrate
Meas. Tech.
SAR analysis of an In Vitro TNAP Dose Response Luminescent Assay
IC50
>100000±n/a nM
Citation
 PubChem, PC SAR analysis of an In Vitro TNAP Dose Response Luminescent Assay PubChem Bioassay (2010)[AID] 
Target
Name:
Alkaline phosphatase, tissue-nonspecific isozyme
Synonyms:
ALPL tissue-nonspecific alkaline phosphatase precursor
Type:
PROTEIN
Mol. Mass.:
57306.17
Organism:
Homo sapiens (Human)
Description:
ChEMBL_1448917
Residue:
524
  
Inhibitor
Name:
BDBM50299540
Synonyms:
CHEMBL569638 cid_16654723
Type:
Small organic molecule
Emp. Form.:
C18H18N2O2
Mol. Mass.:
294.3477
SMILES:
COc1ccc(OC)c(CNc2cnc3ccccc3c2)c1
: