Target
Alkaline phosphatase, tissue-nonspecific isozyme
Ligand
BDBM46003
Substrate
Meas. Tech.
SAR analysis of an In Vitro TNAP Dose Response Luminescent Assay
IC50
>100000±n/a nM
Citation
 PubChem, PC SAR analysis of an In Vitro TNAP Dose Response Luminescent Assay PubChem Bioassay (2010)[AID] 
Target
Name:
Alkaline phosphatase, tissue-nonspecific isozyme
Synonyms:
ALPL tissue-nonspecific alkaline phosphatase precursor
Type:
PROTEIN
Mol. Mass.:
57306.17
Organism:
Homo sapiens (Human)
Description:
ChEMBL_1448917
Residue:
524
  
Inhibitor
Name:
BDBM46003
Synonyms:
3-cyclopentyl-N-(1H-1,2,4-triazol-5-yl)propanamide MLS-0146325.0001 | cid_2199980
Type:
Small organic molecule
Emp. Form.:
C10H16N4O
Mol. Mass.:
208.2602
SMILES:
O=C(CCC1CCCC1)Nc1nnc[nH]1
: