Target
Alkaline phosphatase, tissue-nonspecific isozyme
Ligand
BDBM46033
Substrate
Meas. Tech.
SAR analysis of an In Vitro TNAP Dose Response Luminescent Assay
IC50
>100000±n/a nM
Citation
 PubChem, PC SAR analysis of an In Vitro TNAP Dose Response Luminescent Assay PubChem Bioassay (2010)[AID] 
Target
Name:
Alkaline phosphatase, tissue-nonspecific isozyme
Synonyms:
ALPL tissue-nonspecific alkaline phosphatase precursor
Type:
PROTEIN
Mol. Mass.:
57306.17
Organism:
Homo sapiens (Human)
Description:
ChEMBL_1448917
Residue:
524
  
Inhibitor
Name:
BDBM46033
Synonyms:
MLS-0315714.0001 cid_3524236 ethyl N-[5-chloro-2-(trichloromethyl)-1,3-benzodioxol-2-yl]carbamate
Type:
Small organic molecule
Emp. Form.:
C11H9Cl4NO4
Mol. Mass.:
361.005
SMILES:
CCOC(=O)NC1(Oc2ccc(Cl)cc2O1)C(Cl)(Cl)Cl
: