Target
Nuclear receptor coactivator 2
Ligand
BDBM42440
Substrate
Meas. Tech.
Dose response biochemical High Throughput Screening assay for agonists of the steroid receptor coactivator 2 (SRC-2) recruitment by the peroxisome proliferator-activated receptor gamma (PPARgamma)
EC50
>79370±n/a nM
Citation
 PubChem, PC Dose response biochemical High Throughput Screening assay for agonists of the steroid receptor coactivator 2 (SRC-2) recruitment by the peroxisome proliferator-activated receptor gamma (PPARgamma) PubChem Bioassay (2008)[AID] 
Target
Name:
Nuclear receptor coactivator 2
Synonyms:
BHLHE75 NCOA2 protein SRC2 | TIF2
Type:
Enzyme Catalytic Domain
Mol. Mass.:
159156.93
Organism:
Homo sapiens (Human)
Description:
Q15596
Residue:
1464
  
Inhibitor
Name:
BDBM42440
Synonyms:
1-{[3-(1,3-benzodioxol-5-yl)-1,2,4-oxadiazol-5-yl]methyl}-2-(1-methyl-1H-imidazol-2-yl)piperidine 3-(1,3-benzodioxol-5-yl)-5-[[2-(1-methylimidazol-2-yl)piperidin-1-yl]methyl]-1,2,4-oxadiazole MLS000734887 cid_16189203
Type:
Small organic molecule
Emp. Form.:
C19H21N5O3
Mol. Mass.:
367.4017
SMILES:
Cn1ccnc1C1CCCCN1Cc1nc(no1)-c1ccc2OCOc2c1
: