Target
Bcl-2-like protein 2
Ligand
BDBM33071
Substrate
Meas. Tech.
Multiplexed dose response screen for small molecule regulators of Bcl-2 family protein interactions, specifically Bim-Bcl-W.
EC50
11220±n/a nM
Citation
 PubChem, PC Multiplexed dose response screen for small molecule regulators of Bcl-2 family protein interactions, specifically Bim-Bcl-W. PubChem Bioassay (2008)[AID] 
Target
Name:
Bcl-2-like protein 2
Synonyms:
Apoptosis regulator Bcl-W BCL-W BCLW Bcl2-L-2 | KIAA0271
Type:
Protein
Mol. Mass.:
20742.61
Organism:
Homo sapiens (Human)
Description:
Residue:
193
  
Inhibitor
Name:
BDBM33071
Synonyms:
2,3-Di-furan-2-yl-quinoxaline-6-carboxylic acid (2-hydroxy-ethyl)-amide 2,3-bis(2-furyl)-N-(2-hydroxyethyl)quinoxaline-6-carboxamide MLS000529296 cid_3157644
Type:
Small organic molecule
Emp. Form.:
C19H15N3O4
Mol. Mass.:
349.3401
SMILES:
OCCNC(=O)c1ccc2nc(-c3ccco3)c(nc2c1)-c1ccco1
: