Target
Alkaline phosphatase, germ cell type
Ligand
BDBM41893
Substrate
Meas. Tech.
Luminescent assay for HTS discovery of chemical inhibitors of placental alkaline phosphatase confirmation
IC50
2530±n/a nM
Citation
 PubChem, PC Luminescent assay for HTS discovery of chemical inhibitors of placental alkaline phosphatase confirmation PubChem Bioassay (2009)[AID] 
Target
Name:
Alkaline phosphatase, germ cell type
Synonyms:
ALPG ALPPL2 PPBN_HUMAN | placental-like alkaline phosphatase preproprotein
Type:
PROTEIN
Mol. Mass.:
57374.31
Organism:
Homo sapiens (Human)
Description:
ChEMBL_29964
Residue:
532
  
Inhibitor
Name:
BDBM41893
Synonyms:
1-(3,4-dihydroxyphenyl)-2-[(5-phenyl-4-prop-2-enyl-1,2,4-triazol-3-yl)sulfanyl]ethanone 1-[3,4-bis(oxidanyl)phenyl]-2-[(5-phenyl-4-prop-2-enyl-1,2,4-triazol-3-yl)sulfanyl]ethanone MLS-0390841.0001 | cid_1416608
Type:
Small organic molecule
Emp. Form.:
C19H17N3O3S
Mol. Mass.:
367.422
SMILES:
Oc1ccc(cc1O)C(=O)CSc1nnc(-c2ccccc2)n1CC=C
: