Target
Alkaline phosphatase, germ cell type
Ligand
BDBM50309565
Substrate
Meas. Tech.
Luminescent assay for HTS discovery of chemical inhibitors of placental alkaline phosphatase confirmation
IC50
2130±n/a nM
Citation
 PubChem, PC Luminescent assay for HTS discovery of chemical inhibitors of placental alkaline phosphatase confirmation PubChem Bioassay (2009)[AID] 
Target
Name:
Alkaline phosphatase, germ cell type
Synonyms:
ALPG ALPPL2 PPBN_HUMAN | placental-like alkaline phosphatase preproprotein
Type:
PROTEIN
Mol. Mass.:
57374.31
Organism:
Homo sapiens (Human)
Description:
ChEMBL_29964
Residue:
532
  
Inhibitor
Name:
BDBM50309565
Synonyms:
1-(3,4-dihydroxyphenyl)-2-(4-methyl-1H-pyrazol-1-yl)ethanone cid_25199538
Type:
Small organic molecule
Emp. Form.:
C12H12N2O3
Mol. Mass.:
232.2353
SMILES:
Cc1cnn(CC(=O)c2ccc(O)c(O)c2)c1
: