Target
Phosphoethanolamine/phosphocholine phosphatase
Ligand
BDBM46619
Substrate
Meas. Tech.
SAR assay for compounds that inhibit PHOSPHO1
IC50
555±n/a nM
Citation
 PubChem, PC SAR assay for compounds that inhibit PHOSPHO1 PubChem Bioassay (2010)[AID] 
Target
Name:
Phosphoethanolamine/phosphocholine phosphatase
Synonyms:
PHOP1_HUMAN phosphatase, orphan 1
Type:
Enzyme Catalytic Domain
Mol. Mass.:
29718.09
Organism:
Homo sapiens (Human)
Description:
Q8TCT1
Residue:
267
  
Inhibitor
Name:
BDBM46619
Synonyms:
2-(3-chloranyl-2-methyl-phenyl)-6-nitro-4-[2,2,2-tris(fluoranyl)ethoxy]-1,2-benzothiazol-3-one 2-(3-chloro-2-methylphenyl)-6-nitro-4-(2,2,2-trifluoroethoxy)-1,2-benzothiazol-3-one cid_1510390
Type:
Small organic molecule
Emp. Form.:
C16H10ClF3N2O4S
Mol. Mass.:
418.775
SMILES:
Cc1c(Cl)cccc1-n1sc2cc(cc(OCC(F)(F)F)c2c1=O)[N+]([O-])=O
: