Target
Phosphoethanolamine/phosphocholine phosphatase
Ligand
BDBM46625
Substrate
Meas. Tech.
SAR assay for compounds that inhibit PHOSPHO1
IC50
534±n/a nM
Citation
 PubChem, PC SAR assay for compounds that inhibit PHOSPHO1 PubChem Bioassay (2010)[AID] 
Target
Name:
Phosphoethanolamine/phosphocholine phosphatase
Synonyms:
PHOP1_HUMAN phosphatase, orphan 1
Type:
Enzyme Catalytic Domain
Mol. Mass.:
29718.09
Organism:
Homo sapiens (Human)
Description:
Q8TCT1
Residue:
267
  
Inhibitor
Name:
BDBM46625
Synonyms:
2-(2,4-dichlorophenyl)-6-fluoranyl-1,2-benzothiazol-3-one MLS-0315777.0001 | cid_1510383
Type:
Small organic molecule
Emp. Form.:
C13H6Cl2FNOS
Mol. Mass.:
314.162
SMILES:
Fc1ccc2c(c1)sn(-c1ccc(Cl)cc1Cl)c2=O
: