Target
Phosphoethanolamine/phosphocholine phosphatase
Ligand
BDBM46626
Substrate
Meas. Tech.
SAR assay for compounds that inhibit PHOSPHO1
IC50
359±n/a nM
Citation
 PubChem, PC SAR assay for compounds that inhibit PHOSPHO1 PubChem Bioassay (2010)[AID] 
Target
Name:
Phosphoethanolamine/phosphocholine phosphatase
Synonyms:
PHOP1_HUMAN phosphatase, orphan 1
Type:
Enzyme Catalytic Domain
Mol. Mass.:
29718.09
Organism:
Homo sapiens (Human)
Description:
Q8TCT1
Residue:
267
  
Inhibitor
Name:
BDBM46626
Synonyms:
2-(2,3-dichlorophenyl)-6-fluoro-1,2-benzothiazol-3-one MLS-0315778.0001 | cid_1510382
Type:
Small organic molecule
Emp. Form.:
C13H6Cl2FNOS
Mol. Mass.:
314.162
SMILES:
Fc1ccc2c(c1)sn(-c1cccc(Cl)c1Cl)c2=O
: