Target
Phosphoethanolamine/phosphocholine phosphatase
Ligand
BDBM46627
Substrate
Meas. Tech.
SAR assay for compounds that inhibit PHOSPHO1
IC50
1530±n/a nM
Citation
 PubChem, PC SAR assay for compounds that inhibit PHOSPHO1 PubChem Bioassay (2010)[AID] 
Target
Name:
Phosphoethanolamine/phosphocholine phosphatase
Synonyms:
PHOP1_HUMAN phosphatase, orphan 1
Type:
Enzyme Catalytic Domain
Mol. Mass.:
29718.09
Organism:
Homo sapiens (Human)
Description:
Q8TCT1
Residue:
267
  
Inhibitor
Name:
BDBM46627
Synonyms:
2-(3-chloranyl-2-methyl-phenyl)-6-fluoranyl-1,2-benzothiazol-3-one 2-(3-chloro-2-methylphenyl)-6-fluoro-1,2-benzothiazol-3-one cid_1510381
Type:
Small organic molecule
Emp. Form.:
C14H9ClFNOS
Mol. Mass.:
293.744
SMILES:
Cc1c(Cl)cccc1-n1sc2cc(F)ccc2c1=O
: