Target
Phosphoethanolamine/phosphocholine phosphatase
Ligand
BDBM46629
Substrate
Meas. Tech.
SAR assay for compounds that inhibit PHOSPHO1
IC50
252±n/a nM
Citation
 PubChem, PC SAR assay for compounds that inhibit PHOSPHO1 PubChem Bioassay (2010)[AID] 
Target
Name:
Phosphoethanolamine/phosphocholine phosphatase
Synonyms:
PHOP1_HUMAN phosphatase, orphan 1
Type:
Enzyme Catalytic Domain
Mol. Mass.:
29718.09
Organism:
Homo sapiens (Human)
Description:
Q8TCT1
Residue:
267
  
Inhibitor
Name:
BDBM46629
Synonyms:
2-[2-chloranyl-5-(trifluoromethyl)phenyl]-6-nitro-1,2-benzothiazol-3-one MLS-0315781.0001 | cid_1518797
Type:
Small organic molecule
Emp. Form.:
C14H6ClF3N2O3S
Mol. Mass.:
374.722
SMILES:
[O-][N+](=O)c1ccc2c(c1)sn(-c1cc(ccc1Cl)C(F)(F)F)c2=O
: