Target
Phosphoethanolamine/phosphocholine phosphatase
Ligand
BDBM46637
Substrate
Meas. Tech.
SAR assay for compounds that inhibit PHOSPHO1
IC50
72.5±n/a nM
Citation
 PubChem, PC SAR assay for compounds that inhibit PHOSPHO1 PubChem Bioassay (2010)[AID] 
Target
Name:
Phosphoethanolamine/phosphocholine phosphatase
Synonyms:
PHOP1_HUMAN phosphatase, orphan 1
Type:
Enzyme Catalytic Domain
Mol. Mass.:
29718.09
Organism:
Homo sapiens (Human)
Description:
Q8TCT1
Residue:
267
  
Inhibitor
Name:
BDBM46637
Synonyms:
2-(4-bromophenyl)-4,6-dinitro-1,2-benzothiazol-3-one cid_4333778
Type:
Small organic molecule
Emp. Form.:
C13H6BrN3O5S
Mol. Mass.:
396.173
SMILES:
[O-][N+](=O)c1cc([N+]([O-])=O)c2c(c1)sn(-c1ccc(Br)cc1)c2=O
: