Target
Phosphoethanolamine/phosphocholine phosphatase
Ligand
BDBM46639
Substrate
Meas. Tech.
SAR assay for compounds that inhibit PHOSPHO1
IC50
820±n/a nM
Citation
 PubChem, PC SAR assay for compounds that inhibit PHOSPHO1 PubChem Bioassay (2010)[AID] 
Target
Name:
Phosphoethanolamine/phosphocholine phosphatase
Synonyms:
PHOP1_HUMAN phosphatase, orphan 1
Type:
Enzyme Catalytic Domain
Mol. Mass.:
29718.09
Organism:
Homo sapiens (Human)
Description:
Q8TCT1
Residue:
267
  
Inhibitor
Name:
BDBM46639
Synonyms:
2-(4-chlorophenyl)naphtho[2,3-g][1,2]benzothiazole-3,6,11-trione cid_4147194
Type:
Small organic molecule
Emp. Form.:
C21H10ClNO3S
Mol. Mass.:
391.827
SMILES:
Clc1ccc(cc1)-n1sc2c3C(=O)c4ccccc4C(=O)c3ccc2c1=O
: