Target
Phosphoethanolamine/phosphocholine phosphatase
Ligand
BDBM34966
Substrate
Meas. Tech.
SAR assay for compounds that inhibit PHOSPHO1
IC50
457±n/a nM
Citation
 PubChem, PC SAR assay for compounds that inhibit PHOSPHO1 PubChem Bioassay (2010)[AID] 
Target
Name:
Phosphoethanolamine/phosphocholine phosphatase
Synonyms:
PHOP1_HUMAN phosphatase, orphan 1
Type:
Enzyme Catalytic Domain
Mol. Mass.:
29718.09
Organism:
Homo sapiens (Human)
Description:
Q8TCT1
Residue:
267
  
Inhibitor
Name:
BDBM34966
Synonyms:
3-(3-keto-1,2-benzothiazol-2-yl)-N,N-dimethyl-benzenesulfonamide N,N-dimethyl-3-(3-oxidanylidene-1,2-benzothiazol-2-yl)benzenesulfonamide SMR000364449 | cid_5040456
Type:
Small organic molecule
Emp. Form.:
C15H14N2O3S2
Mol. Mass.:
334.413
SMILES:
CN(C)S(=O)(=O)c1cccc(c1)-n1sc2ccccc2c1=O
: