Target
Phosphoethanolamine/phosphocholine phosphatase
Ligand
BDBM45772
Substrate
Meas. Tech.
SAR assay for compounds that inhibit PHOSPHO1
IC50
139±n/a nM
Citation
 PubChem, PC SAR assay for compounds that inhibit PHOSPHO1 PubChem Bioassay (2010)[AID] 
Target
Name:
Phosphoethanolamine/phosphocholine phosphatase
Synonyms:
PHOP1_HUMAN phosphatase, orphan 1
Type:
Enzyme Catalytic Domain
Mol. Mass.:
29718.09
Organism:
Homo sapiens (Human)
Description:
Q8TCT1
Residue:
267
  
Inhibitor
Name:
BDBM45772
Synonyms:
3-(3-keto-1,2-benzothiazol-2-yl)-N,N-dimethyl-benzamide N,N-dimethyl-3-(3-oxidanylidene-1,2-benzothiazol-2-yl)benzamide cid_16749996
Type:
Small organic molecule
Emp. Form.:
C16H14N2O2S
Mol. Mass.:
298.36
SMILES:
CN(C)C(=O)c1cccc(c1)-n1sc2ccccc2c1=O
: