Target
cAMP and cAMP-inhibited cGMP 3',5'-cyclic phosphodiesterase 10A
Ligand
BDBM146672
Substrate
Meas. Tech.
MPDE10A7 Enzyme Activity
Temperature
298.15±n/a K
IC50
0.001±n/a nM
Comments
extracted
Citation
 Allen, JRChen, JJFrohn, MJHarrington, EHLiu, QPickrell, AJRumfelt, SRzasa, RMZhong, W Unsaturated nitrogen heterocyclic compounds useful as PDE10 inhibitors US Patent  US9718803 Publication Date 8/1/2017 
Target
Name:
cAMP and cAMP-inhibited cGMP 3',5'-cyclic phosphodiesterase 10A
Synonyms:
3',5'-cyclic phosphodiesterase PDE10A Phosphodiesterase 10 (PDE10) | Phosphodiesterase 10A
Type:
Protein
Mol. Mass.:
88412.52
Organism:
Homo sapiens (Human)
Description:
Q9Y233
Residue:
1055
  
Inhibitor
Name:
BDBM146672
Synonyms:
US8957073, 4.6 | US9718803, 4.6
Type:
Small organic molecule
Emp. Form.:
C23H21N5O2
Mol. Mass.:
399.4451
SMILES:
COc1ccc(c(OC)n1)-c1nccnc1C1CN(C1)c1ccc2ccccc2n1
: