Target
Thyroid peroxidase
Ligand
BDBM312261
Substrate
Meas. Tech.
Pharmacological Activity Assay
IC50
38000±n/a nM
Citation
 Inghardt, TBJohannesson, PJurva, UMichaelsson, ELindstedt-Alstermark, ETomkinson, NStonehouse, JPGan, L 1-[2-(aminomethyl)benzyl]-2-thioxo-1,2,3,5-tetrahydro-4H-pyrrolo[3,2-d]pyrimidin-4-ones as inhibitors of myeloperoxidase US Patent  US10016430 Publication Date 7/10/2018 
Target
Name:
Thyroid peroxidase
Synonyms:
PERT_HUMAN Thyroid peroxidase | Thyroid peroxidase (TPO)
Type:
Enzyme
Mol. Mass.:
102965.07
Organism:
Homo sapiens (Human)
Description:
P07202
Residue:
933
  
Inhibitor
Name:
BDBM312261
Synonyms:
1-{2-[(Propan-2-ylamino)methyl]benzyl}-2-thioxo-1,2,3,5-tetrahydro-4H-pyrrolo[3,2-d]pyrimidin-4-one US11000525, Example 13 | US9616063, 13
Type:
Small organic molecule
Emp. Form.:
C17H20N4OS
Mol. Mass.:
328.432
SMILES:
CC(C)NCc1ccccc1Cn1c2cc[nH]c2c(=O)[nH]c1=S
: