Target
Gag-Pol polyprotein [600-1027,K702N]/[600-1155,K702N]
Ligand
BDBM1434
Substrate
poly(rC)500:oligo(dG)10
Meas. Tech.
HIV-1 RT Assay
IC50
1900±n/a nM
Citation
 Klunder, JMHoermann, MCywin, CLDavid, EBrickwood, JRSchwartz, RBarringer, KJPauletti, DShih, CKErickson, DASorge, CLJoseph, DPHattox, SEAdams, JGrob, PM Novel nonnucleoside inhibitors of HIV-1 reverse transcriptase. 7. 8-Arylethyldipyridodiazepinones as potent broad-spectrum inhibitors of wild-type and mutant enzymes. J Med Chem 41:2960-71 (1998)  
Target
Name:
Gag-Pol polyprotein [600-1027,K702N]/[600-1155,K702N]
Synonyms:
EC: 2.7.7.49 | HIV-1 Reverse Transcriptase Mutant (K103N)
Type:
Protein Complex
Mol. Mass.:
Description:
Components:
This complex has 2 components.
Component 1
Name:
Gag-Pol polyprotein [600-1155,K702N]
Synonyms:
HIV-1 Reverse Transcriptase Mutant (K103N) Chain A gag-pol
Type:
Enzyme Subunit
Mol. Mass.:
63913.73
Organism:
Human immunodeficiency virus type 1
Description:
P03366[600-1155,K702N]
Residue:
556
  
Component 2
Name:
Gag-Pol polyprotein [600-1027,K702N]
Synonyms:
HIV-1 Reverse Transcriptase Mutant (K103N) Chain B gag-pol
Type:
Enzyme Subunit
Mol. Mass.:
49953.56
Organism:
Human immunodeficiency virus type 1
Description:
P03366[600-1027,K702N]
Residue:
428
  
Inhibitor
Name:
BDBM1434
Synonyms:
11-cyclopropyl-5,11-dihydro-4-methyl-6H-dipyrido[3,2-b:2 ,3 -e][1,4]diazepin-6-one BI-RG-587 Nevirapine US11420959, Example NVP | Viramune
Type:
Small organic molecule
Emp. Form.:
C15H14N4O
Mol. Mass.:
266.2979
SMILES:
Cc1ccnc2N(C3CC3)c3ncccc3C(=O)Nc12
:
Substrate
Name:
poly(rC)500:oligo(dG)10
Synonyms:
Type:
RNA\DNA duplex
Mol. Mass.:
358.43
Organism:
Description:
The incorporation of Tritium-labeled dGTP onto a (poly)rC:(oligo)dG template:primer.
Residue:
3
NA