Target
Beta-galactosidase
Ligand
BDBM48080
Substrate
Meas. Tech.
HTS Dose response counterscreen for assays utilizing the enzyme, b-galactosidase
EC50
25700±n/a nM
Citation
 PubChem, PC HTS Dose response counterscreen for assays utilizing the enzyme, b-galactosidase PubChem Bioassay (2009)[AID] 
Target
Name:
Beta-galactosidase
Synonyms:
BGAL_ECOLX Lactase | lacZ
Type:
PROTEIN
Mol. Mass.:
116943.87
Organism:
Escherichia coli
Description:
ChEMBL_215882
Residue:
1029
  
Inhibitor
Name:
BDBM48080
Synonyms:
(1Z)-1-(2-pyridinylhydrazinylidene)-2-naphthalenone (1Z)-1-(pyridin-2-ylhydrazinylidene)naphthalen-2-one MLS000540127 cid_5359275
Type:
Small organic molecule
Emp. Form.:
C15H11N3O
Mol. Mass.:
249.2673
SMILES:
Oc1ccc2ccccc2c1N=Nc1ccccn1
: